Zum Inhalt springen

VW 14 installiert nicht korrekt...


LuCapOne

Empfohlene Beiträge

hallo,

habe kürzlich VW 14 Eduversion heruntergeladen und versucht zu installieren.

Ich möchte das Programm nicht auf der Systemplatte installieren (eine kleine ssd für das betriebssystem win7 64, eine große für den rest), die hardwareanforderungen erfüllt mein rechner mehr als genug.

Es fehlen nach der Installation die .exe dateien um VW auszuführen...hier noch die installog als möglichen anhaltspunkt, ich kenne mich damit nicht aus und bitte daher um eure Hilfe.

gruß

Lucas

 

2014-02-19 23:05:42,973 INFO VWInstaller Branch 19.0.2 Build 210668 installer3 Series X

Vectorworks 2014 19.0.2(209336)

Products: Fundamentals Thirdparty1 Thirdparty2 Renderworks Landmark Architect Spotlight

2014-02-19 23:05:42,973 INFO Packages location: K:\Packages

2014-02-19 23:05:42,973 INFO Program started.

2014-02-19 23:05:42,973 INFO Creating pass-through for gettext keys.

2014-02-19 23:05:42,973 INFO Setting language to deu

2014-02-19 23:05:42,973 INFO disconnecting language translations

2014-02-19 23:05:42,974 INFO Required module dependency FAILED: sys version (2, 5) (actually (2, 6, 6, 'final', 0))

2014-02-19 23:05:42,974 INFO Optional module dependency FAILED: flogging version [any] (actually None)

2014-02-19 23:05:42,974 INFO Required module dependency verified: wx version 2.8 (actually 2.8.12.1)

2014-02-19 23:05:42,974 INFO System information:

2014-02-19 23:05:42,974 INFO OS = Windows

2014-02-19 23:05:42,974 INFO User preferred encoding = cp1252

2014-02-19 23:05:42,976 INFO Default locale:

2014-02-19 23:05:42,976 INFO de_DE

2014-02-19 23:05:42,976 INFO cp1252

2014-02-19 23:05:42,976 INFO Current system encoding = mbcs

2014-02-19 23:05:42,976 INFO FileSystem encoding = mbcs

2014-02-19 23:05:42,976 INFO OS platform = Windows-XP-5.1.2600-SP2

2014-02-19 23:05:42,976 INFO OS release = XP

2014-02-19 23:05:42,976 INFO OS version = 5.1.2600

2014-02-19 23:05:42,976 INFO Startup information:

2014-02-19 23:05:42,976 INFO Program location = K:\InstallVectorworks.exe

2014-02-19 23:05:42,976 INFO sys.path:

2014-02-19 23:05:42,976 INFO K:\\InstallVectorworks.exe

2014-02-19 23:05:42,976 INFO Package location = K:\InstallVectorworks.exe\zinstaller

2014-02-19 23:05:42,976 INFO Current Working Directory = K:\

2014-02-19 23:05:42,976 INFO Execution mode (script vs. executable) = executable

2014-02-19 23:05:42,976 INFO Executable location = K:\InstallVectorworks.exe

2014-02-19 23:05:42,977 INFO Invocation = K:\InstallVectorworks.exe

2014-02-19 23:05:42,977 INFO Zen Installer version: 0.1.@@DO_NOT_MODIFY_REVISION@@

2014-02-19 23:05:42,977 INFO

2014-02-19 23:05:42,977 INFO setting language to 'deu'

2014-02-19 23:05:42,977 INFO Bootstrapping Main GUI.

2014-02-19 23:05:42,977 INFO Main GUI has been bootstrapped.

2014-02-19 23:05:42,977 INFO Scanning for available packages...

2014-02-19 23:05:42,979 INFO Interview() called.

2014-02-19 23:05:42,979 INFO Fetching default registration values.

2014-02-19 23:05:42,979 INFO Verifying serial number.

2014-02-19 23:05:42,979 INFO Verifying standard serial

2014-02-19 23:05:42,979 INFO Series X detected.

2014-02-19 23:05:42,979 INFO Serial number verified.

2014-02-19 23:05:42,979 INFO Failure retrieving productselection selection defaults.

2014-02-19 23:05:42,980 INFO Traceback (most recent call last):

2014-02-19 23:05:42,980 INFO File "vwinstaller.pyc", line 874, in GetSelectionDefaults

2014-02-19 23:05:42,980 INFO File "zinstaller\installerlib.pyc", line 243, in EnumerateRegistryValues

2014-02-19 23:05:42,980 INFO WindowsError: [Error 2] Das System kann die angegebene Datei nicht finden

2014-02-19 23:05:42,980 INFO Successfully read productselection selection defaults.

2014-02-19 23:05:42,980 INFO Interview() finished.

2014-02-19 23:05:42,980 INFO Install() called.

2014-02-19 23:05:42,982 INFO Initializing installer routine...

2014-02-19 23:05:42,982 INFO Reading configuration information

2014-02-19 23:05:42,983 INFO products: Basic, Pro, Renderworks, Landschaft, Architektur, Spotlight

2014-02-19 23:05:42,983 INFO gProtectionMode: Series E

2014-02-19 23:05:42,983 INFO gDestination: D:\Programme\Vectorworks2014

2014-02-19 23:05:42,983 INFO gUpdaterMode: Install

2014-02-19 23:05:42,983 INFO gLanguage: deu

2014-02-19 23:05:42,983 INFO successURL: https://secure.nemetschek.net/myVectorworks/updater/index.php?vwVersion=2014(209336)&platform=Win&osVersion=5.1.2600&kind=installer&language=deu&serialNumber=E9XGMU-4Z136S-W7HHYY-G0DMFG

2014-02-19 23:05:42,983 INFO gTargetBuild: 209336

2014-02-19 23:05:42,984 INFO gSerialNumber: E9XGMU-XXXXXX-XXXXXX-G0DMFG

2014-02-19 23:05:42,984 INFO executableName: Vectorworks2014.exe

2014-02-19 23:05:42,984 INFO gErrorFileName: InstallerLog.txt

2014-02-19 23:05:42,984 INFO gZipsLocation: K:\Packages

2014-02-19 23:05:42,984 INFO gUnits: Metric

2014-02-19 23:05:43,045 INFO Unregistration of D:\Programme\Vectorworks2014\VWPreview/VWPreview64.dll returned 3

2014-02-19 23:05:43,085 INFO Unregistration of D:\Programme\Vectorworks2014\VWSearch/VWSearch64.dll returned 3

2014-02-19 23:05:43,292 INFO killing of prevhost.exe returned 128

2014-02-19 23:05:43,292 INFO executableName: D:\Programme\Vectorworks2014\Vectorworks2014.exe

2014-02-19 23:05:43,292 INFO Beginning installation process...

2014-02-19 23:05:44,529 INFO free space: 689.9930112 GB

2014-02-19 23:05:44,529 INFO space needed for install: 7692771081

2014-02-19 23:05:44,533 INFO Installing Libraries.vpkg

2014-02-19 23:05:44,632 INFO Took 0.102467933586 seconds to install Libraries.vpkg

2014-02-19 23:05:45,338 INFO Installing core-win32.vpkg

2014-02-19 23:06:09,779 INFO Took 25.1459382543 seconds to install core-win32.vpkg

2014-02-19 23:06:09,802 INFO Installing custom-libraries.vpkg

2014-02-19 23:06:09,802 INFO Took 0.0225934945901 seconds to install custom-libraries.vpkg

2014-02-19 23:06:09,805 INFO Installing custom-plugins-win32.vpkg

2014-02-19 23:06:09,805 INFO Took 0.00244776944783 seconds to install custom-plugins-win32.vpkg

2014-02-19 23:06:09,808 INFO Installing custom-workspaces-win32.vpkg

2014-02-19 23:06:09,808 INFO Took 0.00244927873963 seconds to install custom-workspaces-win32.vpkg

2014-02-19 23:06:09,835 INFO Installing defaults-arch.vpkg

2014-02-19 23:06:22,046 INFO Took 12.2382006585 seconds to install defaults-arch.vpkg

2014-02-19 23:06:22,049 INFO Installing defaults-archspot.vpkg

2014-02-19 23:06:22,073 INFO Took 0.0273761384588 seconds to install defaults-archspot.vpkg

2014-02-19 23:06:22,092 INFO Installing defaults-arla.vpkg

2014-02-19 23:06:24,901 INFO Took 2.8280584591 seconds to install defaults-arla.vpkg

2014-02-19 23:06:24,914 INFO Installing defaults-arlaspot.vpkg

2014-02-19 23:06:25,197 INFO Took 0.295327353318 seconds to install defaults-arlaspot.vpkg

2014-02-19 23:06:25,210 INFO Installing defaults-basic.vpkg

2014-02-19 23:06:40,299 INFO Took 15.1011874504 seconds to install defaults-basic.vpkg

2014-02-19 23:06:40,311 INFO Installing defaults-land.vpkg

2014-02-19 23:06:40,956 INFO Took 0.657419135164 seconds to install defaults-land.vpkg

2014-02-19 23:06:40,963 INFO Installing defaults-pro.vpkg

2014-02-19 23:06:41,023 INFO Took 0.0668332522341 seconds to install defaults-pro.vpkg

2014-02-19 23:06:41,030 INFO Installing defaults-spot.vpkg

2014-02-19 23:06:48,187 INFO Took 7.16403315371 seconds to install defaults-spot.vpkg

2014-02-19 23:06:48,191 INFO Installing defaults-templates-arch.vpkg

2014-02-19 23:06:49,114 INFO Took 0.926358936155 seconds to install defaults-templates-arch.vpkg

2014-02-19 23:06:49,118 INFO Installing defaults-templates-land.vpkg

2014-02-19 23:06:49,438 INFO Took 0.325455534452 seconds to install defaults-templates-land.vpkg

2014-02-19 23:06:49,466 INFO Installing extras.vpkg

2014-02-19 23:07:00,392 INFO Took 10.9533215287 seconds to install extras.vpkg

2014-02-19 23:07:00,400 INFO Installing libraries-render1.vpkg

2014-02-19 23:07:45,723 INFO Took 45.3311576389 seconds to install libraries-render1.vpkg

2014-02-19 23:07:45,732 INFO Installing libraries-render2.vpkg

2014-02-19 23:08:34,578 ERROR Exception occured in doInstall.

Traceback (most recent call last):

File "vwinstaller.pyc", line 713, in Install

File "installerscript.pyc", line 1768, in doInstall

File "installerscript.pyc", line 1318, in InstallPackages

File "zpackage\__init__.pyc", line 249, in InstallPackage

File "tarfile.pyc", line 817, in read

File "tarfile.pyc", line 735, in read

File "tarfile.pyc", line 744, in readnormal

File "gzip.pyc", line 219, in read

File "gzip.pyc", line 284, in _read

File "gzip.pyc", line 304, in _read_eof

IOError: CRC check failed 0xe8137db2L != 0x5133abf4L

2014-02-19 23:08:34,578 INFO Install() finished.

2014-02-19 23:08:34,585 INFO Finish() called.

2014-02-19 23:08:46,723 INFO NodeText returned: finish

2014-02-19 23:08:46,723 INFO Finish() finished.

2014-02-19 23:08:46,734 INFO Program terminated normally.

Link zu diesem Kommentar
  • 3 Wochen später...

Ich bräuchte wirklich Hilfe damit....VW 14 will einfach nicht korrekt installieren....die installlog bleibt die selbe...hab es mittlerweile mit gecrackten exe dateien versucht und auch mit einer von einem mitstudent...keine chance, dann kommt die meldung falsch installiert und online nach lösung suchen oder reparieren.

also bitte gebt mir eine kurze antwort woran es liegen könnte...

gruß

lucas

Link zu diesem Kommentar

Erstelle ein Benutzerkonto oder melde Dich an, um zu kommentieren

Du musst ein Benutzerkonto haben, um einen Kommentar verfassen zu können

Benutzerkonto erstellen

Neues Benutzerkonto für unsere Community erstellen. Es ist einfach!

Neues Benutzerkonto erstellen

Anmelden

Du hast bereits ein Benutzerkonto? Melde Dich hier an.

Jetzt anmelden
  • Forenstatistik

    • Themen insgesamt
      20Tsd
    • Beiträge insgesamt
      98,7Tsd
×
×
  • Neu erstellen...